{"text_format":"1","workbook":"xlsx","n_sheets":4,"sheets":["シミュシート(メンテ費用有り)","シミュシート(メンテ費用無し)","基礎データ入力","改訂履歴"],"not_rendered":{"charts":0,"images":1,"macros":1,"external_links":0,"defined_names":4,"comments":0,"pivot_tables":0},"unopened":[],"bounds":{"document_bytes":16777216,"sheet_cells":100000,"rows_first":2000,"rows_last":500,"rows_between":2000,"halvings":0,"cell_chars":16384,"cell_head_chars":4096},"cells_cut":0,"cells_raw":0,"read":"whole","date_system":"1900"}

{"sheet":"シミュシート(メンテ費用有り)","index":0,"n_rows":55,"n_cols":71,"rows_kept":55,"cut":false,"hidden":false,"merged":[[4,11,4,12],[32,8,32,10],[44,21,44,23],[33,8,34,10],[36,11,36,13],[37,11,38,13],[37,8,38,10],[36,8,36,10],[25,7,25,9],[40,8,42,10],[43,8,46,10],[40,11,42,13],[43,11,46,13],[4,0,4,3],[4,5,4,6],[9,4,10,6],[13,0,14,0],[9,0,10,3],[17,4,18,5],[13,1,14,2],[13,5,14,6],[12,5,12,6],[13,3,14,4],[12,1,12,2],[24,0,25,1],[24,2,25,2],[33,2,34,2],[33,4,34,4],[5,0,6,3],[24,4,25,5],[30,3,31,3],[30,5,31,5],[5,5,6,6],[26,3,27,3],[24,6,25,6],[30,1,31,1],[8,0,8,3],[17,0,18,1],[17,2,18,3],[12,3,12,4],[43,0,46,2],[40,3,42,4],[43,3,46,4],[40,5,42,7],[43,5,46,7],[40,0,42,2]]}
[null,null,null,null,null,null,null,null,null,null,null,null,null,null,null,"売電金額パターン","単価","売電年数",null,"北海道（帯広）",null,"地域","1月","2月","3月","4月","5月","6月","7月","8月","9月","10月","11月","12月",null,"角度","下","右","左","上","角度2",null,null,null,{"$f":"+基礎データ入力!Q3","v":"0°"},null,-180,-165,-150,-135,-120,-105,-90,-75,-60,-45,-30,-15,0,15,30,45,60,75,90,105,120,135,150,165,180]
[null,null,null,null,null,null,null,null,null,null,null,null,null,null,null,"2018/10kW未満/赤エリア/税込28円",28,10,null,"北海道（札幌）",null,{"$f":"+F6","v":"東京（東京）"},{"$f":"+VLOOKUP($V2,基礎データ入力!$D$3:$P$49,2,FALSE)","v":120.81666666666666},{"$f":"+VLOOKUP($V2,基礎データ入力!$D$3:$P$49,3,FALSE)","v":119.13055555555556},{"$f":"+VLOOKUP($V2,基礎データ入力!$D$3:$P$49,4,FALSE)","v":131.38055555555556},{"$f":"+VLOOKUP($V2,基礎データ入力!$D$3:$P$49,5,FALSE)","v":142.29166666666666},{"$f":"+VLOOKUP($V2,基礎データ入力!$D$3:$P$49,6,FALSE)","v":136.39444444444445},{"$f":"+VLOOKUP($V2,基礎データ入力!$D$3:$P$49,7,FALSE)","v":108.30833333333334},{"$f":"+VLOOKUP($V2,基礎データ入力!$D$3:$P$49,8,FALSE)","v":131.52777777777777},{"$f":"+VLOOKUP($V2,基礎データ入力!$D$3:$P$49,9,FALSE)","v":122.53888888888888},{"$f":"+VLOOKUP($V2,基礎データ入力!$D$3:$P$49,10,FALSE)","v":99.955555555555549},{"$f":"+VLOOKUP($V2,基礎データ入力!$D$3:$P$49,11,FALSE)","v":101.15277777777777},{"$f":"+VLOOKUP($V2,基礎データ入力!$D$3:$P$49,12,FALSE)","v":91.055555555555557},{"$f":"+VLOOKUP($V2,基礎データ入力!$D$3:$P$49,13,FALSE)","v":99.794444444444437},{"$f":"SUM(W2:AH2)","v":1404.3472222222226},"-90°（東）","真東","真北","真南","真西",-90,null,null,null,{"$f":"+基礎データ入力!Q4","v":"5°"},null,{"$f":"+VLOOKUP($C$34,基礎データ入力!$Q$3:$AP$13,2,FALSE)","v":0.79586007733921449},{"$f":"+VLOOKUP($C$34,基礎データ入力!$Q$3:$AP$13,3,FALSE)","v":0.79828904295194481},{"$f":"+VLOOKUP($C$34,基礎データ入力!$Q$3:$AP$13,4,FALSE)","v":0.80535440546715065},{"$f":"+VLOOKUP($C$34,基礎データ入力!$Q$3:$AP$13,5,FALSE)","v":0.81669023765490101},{"$f":"+VLOOKUP($C$34,基礎データ入力!$Q$3:$AP$13,6,FALSE)","v":0.83125611939117616},{"$f":"+VLOOKUP($C$34,基礎データ入力!$Q$3:$AP$13,7,FALSE)","v":0.84802943241719664},{"$f":"+VLOOKUP($C$34,基礎データ入力!$Q$3:$AP$13,8,FALSE)","v":0.86588272526776977},{"$f":"+VLOOKUP($C$34,基礎データ入力!$Q$3:$AP$13,9,FALSE)","v":0.883763709908716},{"$f":"+VLOOKUP($C$34,基礎データ入力!$Q$3:$AP$13,10,FALSE)","v":0.90019878749517868},{"$f":"+VLOOKUP($C$34,基礎データ入力!$Q$3:$AP$13,11,FALSE)","v":0.91427808491489715},{"$f":"+VLOOKUP($C$34,基礎データ入力!$Q$3:$AP$13,12,FALSE)","v":0.92510953092085091},{"$f":"+VLOOKUP($C$34,基礎データ入力!$Q$3:$AP$13,13,FALSE)","v":0.93183665799649895},{"$f":"+VLOOKUP($C$34,基礎データ入力!$Q$3:$AP$13,14,FALSE)","v":0.93412320868731025},{"$f":"+VLOOKUP($C$34,基礎データ入力!$Q$3:$AP$13,15,FALSE)","v":0.93177929643072599},{"$f":"+VLOOKUP($C$34,基礎データ入力!$Q$3:$AP$13,16,FALSE)","v":0.92508183913047781},{"$f":"+VLOOKUP($C$34,基礎データ入力!$Q$3:$AP$13,17,FALSE)","v":0.91430973267532367},{"$f":"+VLOOKUP($C$34,基礎データ入力!$Q$3:$AP$13,18,FALSE)","v":0.90022252331549846},{"$f":"+VLOOKUP($C$34,基礎データ入力!$Q$3:$AP$13,19,FALSE)","v":0.88371821625310298},{"$f":"+VLOOKUP($C$34,基礎データ入力!$Q$3:$AP$13,20,FALSE)","v":0.8660152502645555},{"$f":"+VLOOKUP($C$34,基礎データ入力!$Q$3:$AP$13,21,FALSE)","v":0.84812239771344933},{"$f":"+VLOOKUP($C$34,基礎データ入力!$Q$3:$AP$13,22,FALSE)","v":0.83132534886710907},{"$f":"+VLOOKUP($C$34,基礎データ入力!$Q$3:$AP$13,23,FALSE)","v":0.81679704884634019},{"$f":"+VLOOKUP($C$34,基礎データ入力!$Q$3:$AP$13,24,FALSE)","v":0.80550077635912298},{"$f":"+VLOOKUP($C$34,基礎データ入力!$Q$3:$AP$13,25,FALSE)","v":0.79836025041290437},{"$f":"+VLOOKUP($C$34,基礎データ入力!$Q$3:$AP$13,26,FALSE)","v":0.79586007733921449}]
[null,null,null,{"$f":"90*(1-C3)","v":90},null,null,null,null,null,null,null,null,null,null,null,"2018/10kW未満/青エリア/税込26円",26,10,null,"青森（青森）",null,null,null,null,null,null,null,null,null,null,null,null,null,null,null,"-75°（南東）","南東","北東","南西","北西",-75,null,null,null,{"$f":"+基礎データ入力!Q5","v":"10°"}]
[null,null,null,null,null,null,null,null,null,null,null,null,null,null,null,"2018/10kW以上/18円+税10%",19.8,20,null,"秋田（秋田）",null,"システム発電量計算結果",null,null,null,null,null,null,null,null,null,null,null,null,null,"-60°（南東）","南東","北東","南西","北西",-60,null,null,null,{"$f":"+基礎データ入力!Q6","v":"15°"}]
["お客様名",null,null,null,null,"地域",null,null,null,null,"起動有効期限","2020-05-31",null,"Ver 2.4.0",null,"2019/10kW未満/赤エリア/税込26円",26,10,null,"岩手（盛岡）",null,"地域","1月","2月","3月","4月","5月","6月","7月","8月","9月","10月","11月","12月",null,"-45°（南東）","南東","北東","南西","北西",-45,null,null,null,{"$f":"+基礎データ入力!Q7","v":"20°"}]
["ABC 様",null,null,null,null,"東京（東京）",null,null,null,null,null,null,null,null,null,"2019/10kW未満/青エリア/税込24円",24,10,null,"山形（山形）",null,{"$f":"+F6","v":"東京（東京）"},{"$f":"+W2*$L$30*$N$30*基礎データ入力!$AX$5*基礎データ入力!$AY$3*基礎データ入力!$AZ$3","v":726.01553458918227},{"$f":"+X2*$L$30*$N$30*基礎データ入力!$AX$5*基礎データ入力!$AY$3*基礎データ入力!$AZ$3","v":715.88329957985627},{"$f":"+Y2*$L$30*$N$30*基礎データ入力!$AX$3*基礎データ入力!$AY$3*基礎データ入力!$AZ$3","v":745.63549579111486},{"$f":"+Z2*$L$30*$N$30*基礎データ入力!$AX$3*基礎データ入力!$AY$3*基礎データ入力!$AZ$3","v":807.56027384188951},{"$f":"+AA2*$L$30*$N$30*基礎データ入力!$AX$3*基礎データ入力!$AY$3*基礎データ入力!$AZ$3","v":774.09125556241008},{"$f":"+AB2*$L$30*$N$30*基礎データ入力!$AX$4*基礎データ入力!$AY$3*基礎データ入力!$AZ$3","v":578.53337030735906},{"$f":"+AC2*$L$30*$N$30*基礎データ入力!$AX$4*基礎データ入力!$AY$3*基礎データ入力!$AZ$3","v":702.56097776547028},{"$f":"+AD2*$L$30*$N$30*基礎データ入力!$AX$4*基礎データ入力!$AY$3*基礎データ入力!$AZ$3","v":654.54646194606039},{"$f":"+AE2*$L$30*$N$30*基礎データ入力!$AX$3*基礎データ入力!$AY$3*基礎データ入力!$AZ$3","v":567.28645961789266},{"$f":"+AF2*$L$30*$N$30*基礎データ入力!$AX$3*基礎データ入力!$AY$3*基礎データ入力!$AZ$3","v":574.0811590425069},{"$f":"+AG2*$L$30*$N$30*基礎データ入力!$AX$3*基礎データ入力!$AY$3*基礎データ入力!$AZ$3","v":516.77551540336049},{"$f":"+AH2*$L$30*$N$30*基礎データ入力!$AX$5*基礎データ入力!$AY$3*基礎データ入力!$AZ$3","v":599.68809710881874},{"$f":"SUM(W6:AH6)","v":7962.6579005559206},"-30°（南東）","南東","北東","南西","北西",-30,null,null,null,{"$f":"+基礎データ入力!Q8","v":"25°"}]
[null,null,null,null,null,null,null,null,null,null,null,null,null,null,null,"2019/10kW以上/14円+税10%",15.4,20,null,"宮城（仙台）",null,null,null,null,null,null,null,null,null,null,null,null,null,null,null,"-15°（南東）","南東","北東","南西","北西",-15,null,null,null,{"$f":"+基礎データ入力!Q9","v":"30°"}]
[null,null,null,null,null,null,null,null,null,null,null,null,null,null,null,"2020/10kW未満/税込21円(委員長案)",21,10,null,"福島（郡山）",null,"お客様名",null,null,null,null,null,null,null,null,null,null,null,null,null,"0°（南）","真南","真東","真西","真北",0,null,null,null,{"$f":"+基礎データ入力!Q10","v":"45°"}]
["売電金額パターン(年度にて指定)",null,null,null,{"$f":"$R$15","v":10},"予想収支合計(税込)",null,null,null,null,null,null,null,null,null,"2020/10kW以上/13円+税10%(委員長案)",14.3,20,null,"新潟（新潟）",null,{"$f":"+A6","v":"ABC 様"},null,null,null,null,null,null,null,null,null,null,null,null,null,"15°（南西）","南西","南東","北西","北東",15,null,null,null,{"$f":"+基礎データ入力!Q11","v":"60°"}]
["2020/10kW未満/税込21円(委員長案)",null,null,null,{"$f":"L44*R15","v":1862158.1591167431},null,null,null,null,null,null,null,null,null,null,null,null,null,null,"長野（飯田）",null,null,null,null,null,null,null,null,null,null,null,null,null,null,null,"30°（南西）","南西","南東","北西","北東",30,null,null,null,{"$f":"+基礎データ入力!Q12","v":"75°"}]
{"$rows_left_out":46}
{"sheet":"シミュシート(メンテ費用無し)","index":1,"n_rows":55,"n_cols":71,"rows_kept":55,"cut":false,"hidden":false,"merged":[[9,0,10,3],[9,4,10,6],[4,0,4,3],[4,5,4,6],[5,0,6,3],[5,5,6,6],[8,0,8,3],[17,4,18,5],[24,0,25,1],[24,2,25,2],[24,4,25,5],[12,1,12,2],[12,3,12,4],[12,5,12,6],[13,0,14,0],[13,1,14,2],[13,3,14,4],[13,5,14,6],[44,21,44,23],[32,8,32,10],[33,2,34,2],[33,4,34,4],[33,8,34,10],[36,8,36,10],[36,11,36,13],[43,0,46,2],[43,3,46,4],[43,5,46,7],[43,8,46,10],[43,11,46,13],[4,11,4,12],[40,0,42,2],[40,3,42,4],[40,5,42,7],[40,8,42,10],[40,11,42,13],[37,8,38,10],[37,11,38,13],[24,6,25,6],[25,7,25,9],[26,3,27,3],[30,1,31,1],[30,3,31,3],[30,5,31,5],[17,0,18,1],[17,2,18,3]]}
[null,null,null,null,null,null,null,null,null,null,null,null,null,null,null,"売電金額パターン","単価","売電年数",null,"北海道（帯広）",null,"地域","1月","2月","3月","4月","5月","6月","7月","8月","9月","10月","11月","12月",null,"角度","下","右","左","上","角度2",null,null,null,{"$f":"+基礎データ入力!Q3","v":"0°"},null,-180,-165,-150,-135,-120,-105,-90,-75,-60,-45,-30,-15,0,15,30,45,60,75,90,105,120,135,150,165,180]
[null,null,null,null,null,null,null,null,null,null,null,null,null,null,null,"2018/10kW未満/赤エリア/税込28円",28,10,null,"北海道（札幌）",null,{"$f":"+F6","v":"岡山（岡山）"},{"$f":"+VLOOKUP($V2,基礎データ入力!$D$3:$P$49,2,FALSE)","v":89.419444444444451},{"$f":"+VLOOKUP($V2,基礎データ入力!$D$3:$P$49,3,FALSE)","v":107.13055555555556},{"$f":"+VLOOKUP($V2,基礎データ入力!$D$3:$P$49,4,FALSE)","v":122.18888888888888},{"$f":"+VLOOKUP($V2,基礎データ入力!$D$3:$P$49,5,FALSE)","v":139.03888888888889},{"$f":"+VLOOKUP($V2,基礎データ入力!$D$3:$P$49,6,FALSE)","v":156.18333333333334},{"$f":"+VLOOKUP($V2,基礎データ入力!$D$3:$P$49,7,FALSE)","v":128.66388888888889},{"$f":"+VLOOKUP($V2,基礎データ入力!$D$3:$P$49,8,FALSE)","v":151.4361111111111},{"$f":"+VLOOKUP($V2,基礎データ入力!$D$3:$P$49,9,FALSE)","v":158.86388888888888},{"$f":"+VLOOKUP($V2,基礎データ入力!$D$3:$P$49,10,FALSE)","v":125.82222222222221},{"$f":"+VLOOKUP($V2,基礎データ入力!$D$3:$P$49,11,FALSE)","v":122.68888888888888},{"$f":"+VLOOKUP($V2,基礎データ入力!$D$3:$P$49,12,FALSE)","v":97.469444444444434},{"$f":"+VLOOKUP($V2,基礎データ入力!$D$3:$P$49,13,FALSE)","v":94.575000000000003},{"$f":"SUM(W2:AH2)","v":1493.4805555555556},"-90°（東）","真東","真北","真南","真西",-90,null,null,null,{"$f":"+基礎データ入力!Q4","v":"5°"},null,{"$f":"+VLOOKUP($C$34,基礎データ入力!$Q$3:$AP$13,2,FALSE)","v":0.79586007733921449},{"$f":"+VLOOKUP($C$34,基礎データ入力!$Q$3:$AP$13,3,FALSE)","v":0.79828904295194481},{"$f":"+VLOOKUP($C$34,基礎データ入力!$Q$3:$AP$13,4,FALSE)","v":0.80535440546715065},{"$f":"+VLOOKUP($C$34,基礎データ入力!$Q$3:$AP$13,5,FALSE)","v":0.81669023765490101},{"$f":"+VLOOKUP($C$34,基礎データ入力!$Q$3:$AP$13,6,FALSE)","v":0.83125611939117616},{"$f":"+VLOOKUP($C$34,基礎データ入力!$Q$3:$AP$13,7,FALSE)","v":0.84802943241719664},{"$f":"+VLOOKUP($C$34,基礎データ入力!$Q$3:$AP$13,8,FALSE)","v":0.86588272526776977},{"$f":"+VLOOKUP($C$34,基礎データ入力!$Q$3:$AP$13,9,FALSE)","v":0.883763709908716},{"$f":"+VLOOKUP($C$34,基礎データ入力!$Q$3:$AP$13,10,FALSE)","v":0.90019878749517868},{"$f":"+VLOOKUP($C$34,基礎データ入力!$Q$3:$AP$13,11,FALSE)","v":0.91427808491489715},{"$f":"+VLOOKUP($C$34,基礎データ入力!$Q$3:$AP$13,12,FALSE)","v":0.92510953092085091},{"$f":"+VLOOKUP($C$34,基礎データ入力!$Q$3:$AP$13,13,FALSE)","v":0.93183665799649895},{"$f":"+VLOOKUP($C$34,基礎データ入力!$Q$3:$AP$13,14,FALSE)","v":0.93412320868731025},{"$f":"+VLOOKUP($C$34,基礎データ入力!$Q$3:$AP$13,15,FALSE)","v":0.93177929643072599},{"$f":"+VLOOKUP($C$34,基礎データ入力!$Q$3:$AP$13,16,FALSE)","v":0.92508183913047781},{"$f":"+VLOOKUP($C$34,基礎データ入力!$Q$3:$AP$13,17,FALSE)","v":0.91430973267532367},{"$f":"+VLOOKUP($C$34,基礎データ入力!$Q$3:$AP$13,18,FALSE)","v":0.90022252331549846},{"$f":"+VLOOKUP($C$34,基礎データ入力!$Q$3:$AP$13,19,FALSE)","v":0.88371821625310298},{"$f":"+VLOOKUP($C$34,基礎データ入力!$Q$3:$AP$13,20,FALSE)","v":0.8660152502645555},{"$f":"+VLOOKUP($C$34,基礎データ入力!$Q$3:$AP$13,21,FALSE)","v":0.84812239771344933},{"$f":"+VLOOKUP($C$34,基礎データ入力!$Q$3:$AP$13,22,FALSE)","v":0.83132534886710907},{"$f":"+VLOOKUP($C$34,基礎データ入力!$Q$3:$AP$13,23,FALSE)","v":0.81679704884634019},{"$f":"+VLOOKUP($C$34,基礎データ入力!$Q$3:$AP$13,24,FALSE)","v":0.80550077635912298},{"$f":"+VLOOKUP($C$34,基礎データ入力!$Q$3:$AP$13,25,FALSE)","v":0.79836025041290437},{"$f":"+VLOOKUP($C$34,基礎データ入力!$Q$3:$AP$13,26,FALSE)","v":0.79586007733921449}]
[null,null,null,{"$f":"90*(1-C3)","v":90},null,null,null,null,null,null,null,null,null,null,null,"2018/10kW未満/青エリア/税込26円",26,10,null,"青森（青森）",null,null,null,null,null,null,null,null,null,null,null,null,null,null,null,"-75°（南東）","南東","北東","南西","北西",-75,null,null,null,{"$f":"+基礎データ入力!Q5","v":"10°"}]
[null,null,null,null,null,null,null,null,null,null,null,null,null,null,null,"2018/10kW以上/18円+税10%",19.8,20,null,"秋田（秋田）",null,"システム発電量計算結果",null,null,null,null,null,null,null,null,null,null,null,null,null,"-60°（南東）","南東","北東","南西","北西",-60,null,null,null,{"$f":"+基礎データ入力!Q6","v":"15°"}]
["お客様名",null,null,null,null,"地域",null,null,null,null,"起動有効期限",{"$f":"'シミュシート(メンテ費用有り)'!L5:M5","v":"2020-05-31"},null,{"$f":"'シミュシート(メンテ費用有り)'!N5","v":"Ver 2.4.0"},null,"2019/10kW未満/赤エリア/税込26円",26,10,null,"岩手（盛岡）",null,"地域","1月","2月","3月","4月","5月","6月","7月","8月","9月","10月","11月","12月",null,"-45°（南東）","南東","北東","南西","北西",-45,null,null,null,{"$f":"+基礎データ入力!Q7","v":"20°"}]
["ABC 様",null,null,null,null,"岡山（岡山）",null,null,null,null,null,null,null,null,null,"2019/10kW未満/青エリア/税込24円",24,10,null,"山形（山形）",null,{"$f":"+F6","v":"岡山（岡山）"},{"$f":"+W2*$L$30*$N$30*基礎データ入力!$AX$5*基礎データ入力!$AY$3*基礎データ入力!$AZ$3","v":488.49300162531028},{"$f":"+X2*$L$30*$N$30*基礎データ入力!$AX$5*基礎データ入力!$AY$3*基礎データ入力!$AZ$3","v":585.2477274295095},{"$f":"+Y2*$L$30*$N$30*基礎データ入力!$AX$3*基礎データ入力!$AY$3*基礎データ入力!$AZ$3","v":630.42657306459103},{"$f":"+Z2*$L$30*$N$30*基礎データ入力!$AX$3*基礎データ入力!$AY$3*基礎データ入力!$AZ$3","v":717.36318287203414},{"$f":"+AA2*$L$30*$N$30*基礎データ入力!$AX$3*基礎データ入力!$AY$3*基礎データ入力!$AZ$3","v":805.8189619243816},{"$f":"+AB2*$L$30*$N$30*基礎データ入力!$AX$4*基礎データ入力!$AY$3*基礎データ入力!$AZ$3","v":624.78490792202774},{"$f":"+AC2*$L$30*$N$30*基礎データ入力!$AX$4*基礎データ入力!$AY$3*基礎データ入力!$AZ$3","v":735.3655913380079},{"$f":"+AD2*$L$30*$N$30*基礎データ入力!$AX$4*基礎データ入力!$AY$3*基礎データ入力!$AZ$3","v":771.4344797808393},{"$f":"+AE2*$L$30*$N$30*基礎データ入力!$AX$3*基礎データ入力!$AY$3*基礎データ入力!$AZ$3","v":649.17254827529598},{"$f":"+AF2*$L$30*$N$30*基礎データ入力!$AX$3*基礎データ入力!$AY$3*基礎データ入力!$AZ$3","v":633.00629442386241},{"$f":"+AG2*$L$30*$N$30*基礎データ入力!$AX$3*基礎データ入力!$AY$3*基礎データ入力!$AZ$3","v":502.88801541928325},{"$f":"+AH2*$L$30*$N$30*基礎データ入力!$AX$5*基礎データ入力!$AY$3*基礎データ入力!$AZ$3","v":516.65748893594298},{"$f":"SUM(W6:AH6)","v":7660.6587730110859},"-30°（南東）","南東","北東","南西","北西",-30,null,null,null,{"$f":"+基礎データ入力!Q8","v":"25°"}]
[null,null,null,null,null,null,null,null,null,null,null,null,null,null,null,"2019/10kW以上/14円+税10%",15.4,20,null,"宮城（仙台）",null,null,null,null,null,null,null,null,null,null,null,null,null,null,null,"-15°（南東）","南東","北東","南西","北西",-15,null,null,null,{"$f":"+基礎データ入力!Q9","v":"30°"}]
[null,null,null,null,null,null,null,null,null,null,null,null,null,null,null,"2020/10kW未満/税込21円(委員長案)",21,10,null,"福島（郡山）",null,"お客様名",null,null,null,null,null,null,null,null,null,null,null,null,null,"0°（南）","真南","真東","真西","真北",0,null,null,null,{"$f":"+基礎データ入力!Q10","v":"45°"}]
["売電金額パターン(年度にて指定)",null,null,null,{"$f":"$R$15","v":10},"予想収支合計(税込)",null,null,null,null,null,null,null,null,null,"2020/10kW以上/13円+税10%(委員長案)",14.3,20,null,"新潟（新潟）",null,{"$f":"+A6","v":"ABC 様"},null,null,null,null,null,null,null,null,null,null,null,null,null,"15°（南西）","南西","南東","北西","北東",15,null,null,null,{"$f":"+基礎データ入力!Q11","v":"60°"}]
["2020/10kW未満/税込21円(委員長案)",null,null,null,{"$f":"L44*R15","v":1874738.342332328},null,null,null,null,null,null,null,null,null,null,null,null,null,null,"長野（飯田）",null,null,null,null,null,null,null,null,null,null,null,null,null,null,null,"30°（南西）","南西","南東","北西","北東",30,null,null,null,{"$f":"+基礎データ入力!Q12","v":"75°"}]
{"$rows_left_out":46}
{"sheet":"基礎データ入力","index":2,"n_rows":51,"n_cols":52,"rows_kept":51,"cut":false,"hidden":true,"merged":[[2,50,4,50],[2,51,4,51]]}
["太陽電池モジュール仕様値入力",null,null,"地域別日照量データベース",null,null,null,null,null,null,null,null,null,null,null,null,"屋根傾斜角度別出力ロス率データベース",null,null,null,null,null,null,null,null,null,null,null,null,null,null,null,null,null,null,null,null,null,null,null,null,null,"方位リスト",null,null,null,null,null,"ロス率"]
["型式名","出力 (W)","最小直列数","地域","1月","2月","3月","4月","5月","6月","7月","8月","9月","10月","11月","12月","屋根勾配",-180,-165,-150,-135,-120,-105,-90,-75,-60,-45,-30,-15,0,15,30,45,60,75,90,105,120,135,150,165,180,"角度","下","右","左","上","角度2",null,"温度補正","パワコンによるロス","その他損失"]
["SPR-X22-360",360,1,"北海道（帯広）",114.86666666666666,135.60555555555555,176.44444444444446,150.98888888888888,149.49722222222223,150.83888888888887,123.55277777777778,112.83888888888889,117.73888888888889,119.51666666666667,109.88611111111111,101.29444444444445,"0°",0.86941145055531932,0.86941145055531932,0.86941145055531932,0.86941145055531932,0.86941145055531932,0.86941145055531932,0.86941145055531932,0.86941145055531932,0.86941145055531932,0.86941145055531932,0.86941145055531932,0.86941145055531932,0.86941145055531932,0.86941145055531932,0.86941145055531932,0.86941145055531932,0.86941145055531932,0.86941145055531932,0.86941145055531932,0.86941145055531932,0.86941145055531932,0.86941145055531932,0.86941145055531932,0.86941145055531932,0.86941145055531932,"-90°（東）","真東","真北","真南","真西",-90,"3-5月、9-11月",0.85,0.95,0.95]
["LR6-60HPH-320M",320,1,"北海道（札幌）",70.808333333333337,95.441666666666663,131.48333333333332,141.28888888888889,157.03611111111113,152.76388888888889,139.75,139.81944444444446,122.38055555555555,97.98888888888888,73.374999999999986,64.447222222222223,"5°",0.83489956781027164,0.83609031479631701,0.83963881993413314,0.84519695785902904,0.85249374462235317,0.86091798285086985,0.86982287144086323,0.87890775666828203,0.88724496355562588,0.89441515927724424,0.89985461810054101,0.9033536736126907,0.90458398029926912,0.9034327930137569,0.89989813377112737,0.89439142345692446,0.88732012698663876,0.87894533838378841,0.86992572666224921,0.86096545449150952,0.85252539238277969,0.8453097030055482,0.83964870985926632,0.8360863588262637,0.83489956781027164,"-75°（南東）","南東","北東","南西","北西",-75,"6-8月",0.8]
["LR6-60PE-310M",310,1,"青森（青森）",50.738888888888887,80.061111111111117,122.06388888888888,141.89444444444445,154.07499999999999,147.48333333333335,137.86944444444444,142.29444444444445,128.96944444444443,107.00833333333334,69.013888888888886,48.324999999999996,"10°",0.79586007733921449,0.79828904295194481,0.80535440546715065,0.81669023765490101,0.83125611939117616,0.84802943241719664,0.86588272526776977,0.883763709908716,0.90019878749517868,0.91427808491489715,0.92510953092085091,0.93183665799649895,0.93412320868731025,0.93177929643072599,0.92508183913047781,0.91430973267532367,0.90022252331549846,0.88371821625310298,0.8660152502645555,0.84812239771344933,0.83132534886710907,0.81679704884634019,0.80550077635912298,0.79836025041290437,0.79586007733921449,"-60°（南東）","南東","北東","南西","北西",-60,"12-2月",0.9]
["PM060MW4_325",325,1,"秋田（秋田）",60.963888888888889,96.188888888888883,107.17222222222222,170.61666666666667,133.24444444444444,142.74722222222221,157.74722222222221,165.41111111111113,117.45833333333334,102.36944444444444,59.483333333333327,56.12222222222222,"15°",0.75318505038916861,0.75698080365531628,0.76792499480778931,0.78506225707871391,0.80696448527884646,0.83189698653981192,0.85834660231622051,0.88447974048836453,0.90875357273545443,0.92945714200943497,0.94532058192319479,0.9554696230949532,0.95885593346058373,0.95535292197838062,0.94555398415633996,0.92963713864686048,0.90889796564240011,0.88479226212257578,0.85859582842957882,0.83203742347670429,0.80695657333873982,0.78496533581240791,0.76790521495752273,0.7570539891013025,0.75318505038916861,"-45°（南東）","南東","北東","南西","北西",-45]
[null,null,null,"岩手（盛岡）",86.50555555555556,107.91666666666666,136.50277777777779,147.36666666666665,150.95277777777775,136.49444444444444,125.99444444444444,131.9361111111111,103.78611111111111,103.37222222222222,82.055555555555543,74.647222222222226,"20°",0.70765776903068844,0.71283019987538698,0.72789848980843219,0.75086685193793079,0.78001048332064127,0.81322282990317762,0.84790284137549077,0.88185099838794223,0.9131882151652112,0.94003738391700375,0.9606479878947316,0.97371257899577701,0.97807799194960099,0.97375213869631005,0.96089523602306326,0.94020353465924267,0.91324953270103748,0.8819400077141416,0.84790284137549077,0.81335139892991015,0.78049113368211798,0.75138903998496731,0.72814771592179051,0.71300228457270576,0.70765776903068844,"-30°（南東）","南東","北東","南西","北西",-30]
[null,null,null,"山形（山形）",78.716666666666669,101.15833333333333,119.69166666666666,137.90555555555554,152.8111111111111,129.93888888888887,141.9361111111111,144.75277777777777,113.44444444444443,106.44444444444444,77.088888888888889,61.902777777777771,"25°",0.66003184555892913,0.66695281516718918,0.6863153105930988,0.71525323153303733,0.75154727878709959,0.7920603681030135,0.83418551521564976,0.87542056906629218,0.91328513643151721,0.94579134235953832,0.97085241264723621,0.98641915480699816,0.99192586512120107,0.98663673315992995,0.9709038402579292,0.94575969459911191,0.91350073679942245,0.87556100600318454,0.83444265326911471,0.7926339837607429,0.75202199519349644,0.71587036286135319,0.68671486356848277,0.66714270172974788,0.66003184555892913,"-15°（南東）","南東","北東","南西","北西",-15]
[null,null,null,"宮城（仙台）",103.00833333333333,116.94166666666666,144.13888888888889,143.20555555555555,152.625,117.78888888888889,117.49166666666667,130.66944444444445,107.01111111111111,110.97222222222221,100.57499999999999,95.802777777777777,"30°",0.61217449783905131,0.62045829913067563,0.64423367915104879,0.67896314024902826,0.72166783697447412,0.76934123208687311,0.81812625478425127,0.86571261855547754,0.9091946633963981,0.94648759308892028,0.97550067745987168,0.99373572142058886,1,0.99393945387833416,0.97550661141495154,0.94667747965147908,0.90941421973435665,0.86559987340895828,0.81855349955000845,0.7698970458793627,0.72270825709849373,0.68008465775914073,0.64507234480234987,0.62118817560551065,0.61217449783905131,"0°（南）","真南","真東","真西","真北",0]
[null,null,null,"福島（郡山）",93.49166666666666,110.09444444444443,129.42222222222222,139.3472222222222,137.05277777777778,109.11388888888888,114.21944444444443,135.19444444444443,104.05277777777776,113.90833333333333,87.838888888888889,78.588888888888889,"45°",0.49171323173083581,0.49901990841929328,0.52566534471334048,0.57268600476694387,0.63058756045216735,0.69347561638958388,0.75665839209597185,0.81777021747945366,0.87328038926745322,0.92072236013173381,0.95829022974296085,0.98205374185317418,0.9901239207619198,0.98209725752376054,0.95842868869482656,0.921046749676105,0.87313995233056085,0.81807482717355828,0.75788474281249696,0.69508371821625314,0.63326773016328264,0.57583297894434937,0.52885385657630568,0.50163678260955569,0.49171323173083581,"15°（南西）","南西","南東","北西","北東",15]
{"$rows_left_out":42}
{"sheet":"改訂履歴","index":3,"n_rows":53,"n_cols":4,"rows_kept":53,"cut":false,"hidden":false,"merged":[]}
["改定履歴",null,null,"Pass　123456"]
[]
["更新日付","バーション","担当者","改定理由・改定部分"]
["2016-03-15","beta1.0.2","SIS矢部","余剰契約、単価設定追加、パネル250W，255W，260W，265W種目削除"]
["2016-04-18","beta1.0.3","SIS矢部","パネル劣化率修正"]
["2016-04-19","beta1.0.4","SIS矢部","パネル劣化率計算式削除、マクロ有効ブック形式に変更"]
["2016-05-10","beta1.0.5","SIS矢部","売電単価入力文言を改定"]
["2016-05-16","beta1.0.6","SIS矢部","家庭内消費電力を変更　昼間在宅1800→2000、昼間不在600→800、予想売電量欄を追加"]
["2016-05-16","beta1.0.6","SIS矢部","自己消費バランス9月8%→6%へ12月10%→12%"]
["2016-05-19",1.1000000000000001,"SIS矢部","正式リリースバーション1.1に改定"]
{"$rows_left_out":43}